Top-Themen

AppleEntwicklungHardwareInternetLinuxMicrosoftMultimediaNetzwerkeOff TopicSicherheitSonstige SystemeVirtualisierungWeiterbildungZusammenarbeit

Aktuelle Themen

Administrator.de FeedbackApache ServerAppleAssemblerAudioAusbildungAuslandBackupBasicBatch & ShellBenchmarksBibliotheken & ToolkitsBlogsCloud-DiensteClusterCMSCPU, RAM, MainboardsCSSC und C++DatenbankenDatenschutzDebianDigitiales FernsehenDNSDrucker und ScannerDSL, VDSLE-BooksE-BusinessE-MailEntwicklungErkennung und -AbwehrExchange ServerFestplatten, SSD, RaidFirewallFlatratesGoogle AndroidGrafikGrafikkarten & MonitoreGroupwareHardwareHosting & HousingHTMLHumor (lol)Hyper-VIconsIDE & EditorenInformationsdiensteInstallationInstant MessagingInternetInternet DomäneniOSISDN & AnaloganschlüsseiTunesJavaJavaScriptKiXtartKVMLAN, WAN, WirelessLinuxLinux DesktopLinux NetzwerkLinux ToolsLinux UserverwaltungLizenzierungMac OS XMicrosoftMicrosoft OfficeMikroTik RouterOSMonitoringMultimediaMultimedia & ZubehörNetzwerkeNetzwerkgrundlagenNetzwerkmanagementNetzwerkprotokolleNotebook & ZubehörNovell NetwareOff TopicOpenOffice, LibreOfficeOutlook & MailPapierkorbPascal und DelphiPeripheriegerätePerlPHPPythonRechtliche FragenRedHat, CentOS, FedoraRouter & RoutingSambaSAN, NAS, DASSchriftartenSchulung & TrainingSEOServerServer-HardwareSicherheitSicherheits-ToolsSicherheitsgrundlagenSolarisSonstige SystemeSoziale NetzwerkeSpeicherkartenStudentenjobs & PraktikumSuche ProjektpartnerSuseSwitche und HubsTipps & TricksTK-Netze & GeräteUbuntuUMTS, EDGE & GPRSUtilitiesVB for ApplicationsVerschlüsselung & ZertifikateVideo & StreamingViren und TrojanerVirtualisierungVisual StudioVmwareVoice over IPWebbrowserWebentwicklungWeiterbildungWindows 7Windows 8Windows 10Windows InstallationWindows MobileWindows NetzwerkWindows ServerWindows SystemdateienWindows ToolsWindows UpdateWindows UserverwaltungWindows VistaWindows XPXenserverXMLZusammenarbeit

Open-Xchange auf Opensuse 10.3 mit Community Installer - Compiler Fehler?

Frage Linux Suse

Mitglied: doublebind

doublebind (Level 1) - Jetzt verbinden

02.01.2008 um 16:54 Uhr, 10975 Aufrufe

Hallo! Ich habe ein Problem bei einer Installation von Open-Xchange auf OpenSuse 10.3 mit dem Community Installer. Unten das Log.
Es gibt Compiler fehler raus. z.B. kann javac nicht gefunden werden. Es sind aber alle Java Devel. Packete installiert.

Hier das log:


Open-Xchange Community Edition (Hyperion) Installation Script
For OpenSuSE 10.3

This installation package contains 3rd party components.
YOU MUST AGREE TO ALL OF THE LICENSES USED BY THE COMPONENTS OF THIS PACKAGE TO
COMPILE THE SOFTWARE. DO NOT CONTINUE IF YOU DO NOT AGREE TO ANY OF THE LICENSES
USED BY THE COMPONENTS OF THIS PACKAGE.

Look at /tmp/hyperion-install/license for the specific license document.

sun.txt - Sun Microsystems Inc. ENTITLEMENT for SOFTWARE
- mail.jar (Sun JavaMail 1.4)
apache.txt - Apache License Version 2.0, January 2004
- commons-cli-1.0.jar (Apache Commons CLI)
- commons-io.jar (Apache Commons IO)
- commons-fileupload.jar (Apache Commons Fileupload)
- jcs-1.2.7.9.2.jar (Java Caching System)
- spring-beans_1.2.7.jar (Spring Framework)
- spring-core_1.2.7.jar (Spring Framework)
epl.txt - Eclipse Public License - v 1.0
- org.eclipse.osgi_3.2.2.ox.jar (Equinox OSGI)
gnu-gplv2.txt - GNU GENERAL PUBLIC LICENSE Version 2, June 1991
- Open-Xchange Server Components
(open-xchange, open-xchange-admin*)
- NSS MySQL library (http://www.nongnu.org/nss-mysql/)
- PAM-MySQL backend (http://pam-mysql.sourceforge.net/)
gnu-gplv3.txt - GNU GENERAL PUBLIC LICENSE Version 3, 29 June 2007
- tnef.jar (Java TNEF)
cc-byncsa.txt - Creative Commons Attribution-NonCommercial-ShareAlike 2.5
- Digital content and Javascript code of the Open-Xchange GUI Frontend
(open-xchange-gui)
json.txt - JSON.org license
- json.jar (JavaScript Object Notation)
xerox.txt - Xerox Corporation
- jcs-1.2.7.9.2.jar (Java Caching System)

Press [y] to agree the licenses, press [n] to decline. [y/n] y
Downloading required packages...
Depending on your internet connection, this may take a while.
  • Füge Repository 'openSuSE-oss' hinzu
Ein Repository mit dem Namen 'openSuSE-oss' existiert bereits. Bitte wählen Sie
einen anderen Alias.
  • Füge Repository 'openSuSE-non-oss' hinzu
Ein Repository mit dem Namen 'openSuSE-non-oss' existiert bereits. Bitte wählen
Sie einen anderen Alias.
  • Lese Cache für Repository 'openSuSE-non-oss'
  • Lese Cache für Repository 'openSuSE-oss'
  • Lese Cache für Repository 'openSUSE BuildService - OpenOffice.org'
  • Lese Cache für Repository 'openSUSE BuildService - Mozilla'
  • Lese Cache für Repository 'Facktory'
  • Lese Cache für Repository 'openSUSE BuildService - Datenbanken'
  • Lese Cache für Repository 'openSUSE BuildService - KDE:Community'
  • Lese Cache für Repository 'Haupt-Repository (Nicht-OSS)'
  • Lese Cache für Repository 'openSUSE BuildService - PHP'
  • Lese Cache für Repository 'Haupt-Update Repository'
  • Lese Cache für Repository 'openSUSE-10.3-FTP 10.3'
  • Lese Cache für Repository 'Packman Repository'
  • Lese Cache für Repository 'openSUSE BuildService - KDE:Backports'
  • Lese Cache für Repository 'openSUSE BuildService - Mail Server'
  • Lese Cache für Repository 'VideoLan Repository'
  • Lese Cache für Repository 'Haupt-Repository (Opensource Software - OSS)'
  • Lese installierte Pakete [100%]

Paket 'java-1_6_0-sun' wird übersprungen: bereits installiert
Paket 'java-1_6_0-sun-devel' wird übersprungen: bereits installiert
Paket 'mysql' wird übersprungen: bereits installiert
Paket 'cyrus-imapd' wird übersprungen: bereits installiert
Paket 'ant' wird übersprungen: bereits installiert
Paket 'apache2' wird übersprungen: bereits installiert
Paket 'apache2-mod_jk' wird übersprungen: bereits installiert
Paket 'postfix-mysql' wird übersprungen: bereits installiert
Paket 'cyrus-sasl' wird übersprungen: bereits installiert
Paket 'cyrus-sasl-saslauthd' wird übersprungen: bereits installiert
Paket 'gettext' wird übersprungen: bereits installiert
Paket 'gettext-devel' wird übersprungen: bereits installiert
Paket 'cvs' wird übersprungen: bereits installiert
Paket 'ant-trax' wird übersprungen: bereits installiert
Paket 'ant-apache-regexp' wird übersprungen: bereits installiert
Paket 'ant-nodeps' wird übersprungen: bereits installiert
Paket 'make' wird übersprungen: bereits installiert
Paket 'gcc' wird übersprungen: bereits installiert
Paket 'automake' wird übersprungen: bereits installiert
Paket 'autoconf' wird übersprungen: bereits installiert
Paket 'gcc-c++' wird übersprungen: bereits installiert
Paket 'libmysqlclient-devel' wird übersprungen: bereits installiert
Paket 'pam-devel' wird übersprungen: bereits installiert
Paket 'gnu-jaf' wird übersprungen: bereits installiert
Paket 'jakarta-commons-codec' wird übersprungen: bereits installiert
Paket 'jakarta-commons-httpclient3' wird übersprungen: bereits installiert
Paket 'jakarta-commons-logging' wird übersprungen: bereits installiert
Paket 'junit' wird übersprungen: bereits installiert
Paket 'mysql-connector-java' wird übersprungen: bereits installiert
Paket 'saxon' wird übersprungen: bereits installiert
Paket 'servletapi4' wird übersprungen: bereits installiert
Keine auszuführenden Aktionen.
Creating Open-Xchange directories... done.
CVS checkout required Open-Xchange repositories...
+ -r bf_6_4 open-xchange ... done.
+ -r bf_6_4 open-xchange-admin ... done.
+ open-xchange-admin-console-ee ... done.
+ -r bf_6_4 open-xchange-admin-plugin-imap ... done.
+ -r bf_6_4 open-xchange-admin-plugin-mail ... done.
+ -r bf_6_4 open-xchange-admin-plugin-mailfilter ... done.
+ -r bf_6_4 open-xchange-admin-plugin-context_light ... done.
+ -r bf_6_4 open-xchange-admin-plugin-ca_mgmt_simple ... done.
+ -r bf_6_4 open-xchange-admin-plugin-osconfig ... done.
+ -r bf_6_4 open-xchange-admin-plugin-services ... done.
+ -r bf_6_4 open-xchange-admin-plugin-sw-update ... done.
+ -r bf_6_4 open-xchange-admin-plugin-backup ... done.
+ -r bf_6_4 open-xchange-gui ... done.
+ open-xchange-admin-gui-ee ...? open-xchange-admin-gui-ee/tmpsrc
done.
+ open-xchange-admin-gui-ee-ajax ... done.
+ open-xchange-admin-gui-ee-templates ... done.
+ ...cvs [checkout aborted]: must specify at least one module or directory
done.
+ ...cvs [checkout aborted]: must specify at least one module or directory
done.
+ ...cvs [checkout aborted]: must specify at least one module or directory
done.
Installing binary dependencies... done.
Compiling source dependencies (nss-mysql)...
checking for a BSD-compatible install... /usr/bin/install -c
checking whether build environment is sane... yes
checking for gawk... gawk
checking whether make sets $(MAKE)... yes
configure: Defaulting configuration directory to "/etc"
checking build system type... i686-pc-linux-gnu
checking host system type... i686-pc-linux-gnu
checking whether to enable maintainer-specific portions of Makefiles... no
checking for gcc... gcc
checking for C compiler default output file name... a.out
checking whether the C compiler works... yes
checking whether we are cross compiling... no
checking for suffix of executables...
checking for suffix of object files... o
checking whether we are using the GNU C compiler... yes
checking whether gcc accepts -g... yes
checking for gcc option to accept ANSI C... none needed
checking for style of include used by make... GNU
checking dependency style of gcc... gcc3
checking for a BSD-compatible install... /usr/bin/install -c
checking whether ln -s works... yes
checking for gawk... (cached) gawk
checking for a sed that does not truncate output... /usr/bin/sed
checking for egrep... grep -E
checking for ld used by gcc... /usr/i586-suse-linux/bin/ld
checking if the linker (/usr/i586-suse-linux/bin/ld) is GNU ld... yes
checking for /usr/i586-suse-linux/bin/ld option to reload object files... -r
checking for BSD-compatible nm... /usr/bin/nm -B
checking how to recognise dependent libraries... pass_all
checking how to run the C preprocessor... gcc -E
checking for ANSI C header files... yes
checking for sys/types.h... yes
checking for sys/stat.h... yes
checking for stdlib.h... yes
checking for string.h... yes
checking for memory.h... yes
checking for strings.h... yes
checking for inttypes.h... yes
checking for stdint.h... yes
checking for unistd.h... yes
checking dlfcn.h usability... yes
checking dlfcn.h presence... yes
checking for dlfcn.h... yes
checking for g++... g++
checking whether we are using the GNU C++ compiler... yes
checking whether g++ accepts -g... yes
checking dependency style of g++... gcc3
checking how to run the C++ preprocessor... g++ -E
checking for g77... no
checking for f77... no
checking for xlf... no
checking for frt... no
checking for pgf77... no
checking for fort77... no
checking for fl32... no
checking for af77... no
checking for f90... no
checking for xlf90... no
checking for pgf90... no
checking for epcf90... no
checking for f95... no
checking for fort... no
checking for xlf95... no
checking for ifc... no
checking for efc... no
checking for pgf95... no
checking for lf95... no
checking for gfortran... no
checking whether we are using the GNU Fortran 77 compiler... no
checking whether accepts -g... no
checking the maximum length of command line arguments... 32768
checking command to parse /usr/bin/nm -B output from gcc object... ok
checking for objdir... .libs
checking for ar... ar
checking for ranlib... ranlib
checking for strip... strip
checking if gcc static flag works... yes
checking if gcc supports -fno-rtti -fno-exceptions... no
checking for gcc option to produce PIC... -fPIC
checking if gcc PIC flag -fPIC works... yes
checking if gcc supports -c -o file.o... yes
checking whether the gcc linker (/usr/i586-suse-linux/bin/ld) supports shared li
braries... yes
checking whether -lc should be explicitly linked in... no
checking dynamic linker characteristics... GNU/Linux ld.so
checking how to hardcode library paths into programs... immediate
checking whether stripping libraries is possible... yes
checking if libtool supports shared libraries... yes
checking whether to build shared libraries... yes
checking whether to build static libraries... no
configure: creating libtool
checking for pthread_mutex_lock in -lpthread... yes
checking for zlibVersion in -lz... yes
checking Mysql installation directory... lib = /usr/lib/mysql, include = /usr/i
nclude/mysql
checking for mysql_real_connect in -lmysqlclient_r... yes
checking mysql.h usability... yes
checking mysql.h presence... yes
checking for mysql.h... yes
checking for ANSI C header files... (cached) yes
checking for stdlib.h... (cached) yes
checking for string.h... (cached) yes
checking syslog.h usability... yes
checking syslog.h presence... yes
checking for syslog.h... yes
checking for unistd.h... (cached) yes
checking nsswitch.h usability... no
checking nsswitch.h presence... no
checking for nsswitch.h... no
checking shadow.h usability... yes
checking shadow.h presence... yes
checking for shadow.h... yes
checking signal.h usability... yes
checking signal.h presence... yes
checking for signal.h... yes
checking pthread.h usability... yes
checking pthread.h presence... yes
checking for pthread.h... yes
checking for an ANSI C-conforming const... yes
checking for inline... inline
checking for size_t... yes
checking for uid_t in sys/types.h... yes
checking for gid_t... yes
checking whether lstat dereferences a symlink specified with a trailing slash...
yes
checking whether stat accepts an empty string... no
checking for endgrent... yes
checking for endpwent... yes
checking for getspnam... yes
checking for memset... yes
checking for strchr... yes
checking for strdup... yes
checking for strerror... yes
checking for strtol... yes
checking for vasprintf... yes
checking for sigwait... yes
checking for mysql_real_escape_string... yes
configure: creating ./config.status
config.status: creating Makefile
config.status: creating tests/Makefile
config.status: creating src/Makefile
config.status: creating src/config.h
config.status: src/config.h is unchanged
config.status: executing depfiles commands
Making all in tests
make[1]: Entering directory `/usr/src/nss-mysql-1.0/tests'
make[1]: Für das Ziel »all« ist nichts zu tun.
make[1]: Leaving directory `/usr/src/nss-mysql-1.0/tests'
Making all in src
make[1]: Entering directory `/usr/src/nss-mysql-1.0/src'
make all-am
make[2]: Entering directory `/usr/src/nss-mysql-1.0/src'
make[2]: Leaving directory `/usr/src/nss-mysql-1.0/src'
make[1]: Leaving directory `/usr/src/nss-mysql-1.0/src'
make[1]: Entering directory `/usr/src/nss-mysql-1.0'
make[1]: Für das Ziel »all-am« ist nichts zu tun.
make[1]: Leaving directory `/usr/src/nss-mysql-1.0'
Making install in tests
make[1]: Entering directory `/usr/src/nss-mysql-1.0/tests'
make[2]: Entering directory `/usr/src/nss-mysql-1.0/tests'
make[2]: Für das Ziel »install-exec-am« ist nichts zu tun.
make[2]: Für das Ziel »install-data-am« ist nichts zu tun.
make[2]: Leaving directory `/usr/src/nss-mysql-1.0/tests'
make[1]: Leaving directory `/usr/src/nss-mysql-1.0/tests'
Making install in src
make[1]: Entering directory `/usr/src/nss-mysql-1.0/src'
make[2]: Entering directory `/usr/src/nss-mysql-1.0/src'
test -z "/usr/lib" || mkdir -p -- "/usr/lib"
/bin/sh ../libtool --mode=install /usr/bin/install -c 'libnss_mysql.la' '/usr/
lib/libnss_mysql.la'
/usr/bin/install -c .libs/libnss_mysql.so.2.0.0 /usr/lib/libnss_mysql.so.2.0.0
(cd /usr/lib && rm -f libnss_mysql.so.2 && ln -s libnss_mysql.so.2.0.0 libnss_my
sql.so.2)
(cd /usr/lib && rm -f libnss_mysql.so && ln -s libnss_mysql.so.2.0.0 libnss_mysq
l.so)
/usr/bin/install -c .libs/libnss_mysql.lai /usr/lib/libnss_mysql.la
PATH="$PATH:/sbin" ldconfig -n /usr/lib
Libraries have been installed in:
/usr/lib

If you ever happen to want to link against installed libraries
in a given directory, LIBDIR, you must either use libtool, and
specify the full pathname of the library, or use the `-LLIBDIR'
flag during linking and do at least one of the following:
- add LIBDIR to the `LD_LIBRARY_PATH' environment variable
during execution
- add LIBDIR to the `LD_RUN_PATH' environment variable
during linking
- use the `-Wl,--rpath -Wl,LIBDIR' linker flag
- have your system administrator add LIBDIR to `/etc/ld.so.conf'

See any operating system documentation about shared libraries for
more information, such as the ld(1) and ld.so(8) manual pages.
make[2]: Für das Ziel »install-data-am« ist nichts zu tun.
make[2]: Leaving directory `/usr/src/nss-mysql-1.0/src'
make[1]: Leaving directory `/usr/src/nss-mysql-1.0/src'
make[1]: Entering directory `/usr/src/nss-mysql-1.0'
make[2]: Entering directory `/usr/src/nss-mysql-1.0'
make[2]: Für das Ziel »install-exec-am« ist nichts zu tun.
if [ ! -d /etc ] ; then mkdir -p /etc ; fi
if [ ! -e /etc/nss-mysql.conf ] ; then /usr/bin/install -c -m 644 ./nss-mysql.co
nf /etc/nss-mysql.conf ; fi
if [ ! -e /etc/nss-mysql-root.conf ] ; then /usr/bin/install -c -m 644 -m 600 ./
nss-mysql-root.conf /etc/nss-mysql-root.conf ; fi
make[2]: Leaving directory `/usr/src/nss-mysql-1.0'
make[1]: Leaving directory `/usr/src/nss-mysql-1.0'
Compiling source dependencies (pam_mysql)...
checking for a BSD-compatible install... /usr/bin/install -c
checking whether build environment is sane... yes
checking whether make sets $(MAKE)... yes
checking for working aclocal-1.4... missing
checking for working autoconf... found
checking for working automake-1.4... missing
checking for working autoheader... found
checking for working makeinfo... missing
checking whether to enable maintainer-specific portions of Makefiles... no
checking for bison... no
checking for byacc... no
checking for g++... g++
checking for C++ compiler default output file name... a.out
checking whether the C++ compiler works... yes
checking whether we are cross compiling... no
checking for suffix of executables...
checking for suffix of object files... o
checking whether we are using the GNU C++ compiler... yes
checking whether g++ accepts -g... yes
checking for gcc... gcc
checking whether we are using the GNU C compiler... yes
checking whether gcc accepts -g... yes
checking for gcc option to accept ANSI C... none needed
checking how to run the C preprocessor... gcc -E
checking whether ln -s works... yes
checking whether make sets $(MAKE)... (cached) yes
checking for a BSD-compatible install... /usr/bin/install -c
checking build system type... i686-pc-linux-gnu
checking host system type... i686-pc-linux-gnu
checking for a sed that does not truncate output... /usr/bin/sed
checking for egrep... grep -E
checking for ld used by gcc... /usr/i586-suse-linux/bin/ld
checking if the linker (/usr/i586-suse-linux/bin/ld) is GNU ld... yes
checking for /usr/i586-suse-linux/bin/ld option to reload object files... -r
checking for BSD-compatible nm... /usr/bin/nm -B
checking how to recognise dependent libraries... pass_all
checking for ANSI C header files... yes
checking for sys/types.h... yes
checking for sys/stat.h... yes
checking for stdlib.h... yes
checking for string.h... yes
checking for memory.h... yes
checking for strings.h... yes
checking for inttypes.h... yes
checking for stdint.h... yes
checking for unistd.h... yes
checking dlfcn.h usability... yes
checking dlfcn.h presence... yes
checking for dlfcn.h... yes
checking how to run the C++ preprocessor... g++ -E
checking for g77... no
checking for f77... no
checking for xlf... no
checking for frt... no
checking for pgf77... no
checking for fort77... no
checking for fl32... no
checking for af77... no
checking for f90... no
checking for xlf90... no
checking for pgf90... no
checking for epcf90... no
checking for f95... no
checking for fort... no
checking for xlf95... no
checking for ifc... no
checking for efc... no
checking for pgf95... no
checking for lf95... no
checking for gfortran... no
checking whether we are using the GNU Fortran 77 compiler... no
checking whether accepts -g... no
checking the maximum length of command line arguments... 32768
checking command to parse /usr/bin/nm -B output from gcc object... ok
checking for objdir... .libs
checking for ar... ar
checking for ranlib... ranlib
checking for strip... strip
checking if gcc static flag works... yes
checking if gcc supports -fno-rtti -fno-exceptions... no
checking for gcc option to produce PIC... -fPIC
checking if gcc PIC flag -fPIC works... yes
checking if gcc supports -c -o file.o... yes
checking whether the gcc linker (/usr/i586-suse-linux/bin/ld) supports shared li
braries... yes
checking whether -lc should be explicitly linked in... no
checking dynamic linker characteristics... cat: /etc/ld.so.conf.d/*.conf: No suc
h file or directory
GNU/Linux ld.so
checking how to hardcode library paths into programs... immediate
checking whether stripping libraries is possible... yes
checking if libtool supports shared libraries... yes
checking whether to build shared libraries... yes
checking whether to build static libraries... no
configure: creating libtool
appending configuration tag "CXX" to libtool
checking for ld used by g++... /usr/i586-suse-linux/bin/ld
checking if the linker (/usr/i586-suse-linux/bin/ld) is GNU ld... yes
checking whether the g++ linker (/usr/i586-suse-linux/bin/ld) supports shared li
braries... yes
checking for g++ option to produce PIC... -fPIC
checking if g++ PIC flag -fPIC works... yes
checking if g++ supports -c -o file.o... yes
checking whether the g++ linker (/usr/i586-suse-linux/bin/ld) supports shared li
braries... yes
checking dynamic linker characteristics... cat: /etc/ld.so.conf.d/*.conf: No suc
h file or directory
GNU/Linux ld.so
checking how to hardcode library paths into programs... immediate
checking whether stripping libraries is possible... yes
appending configuration tag "F77" to libtool
checking for ANSI C header files... (cached) yes
checking arpa/inet.h usability... yes
checking arpa/inet.h presence... yes
checking for arpa/inet.h... yes
checking netinet/in.h usability... yes
checking netinet/in.h presence... yes
checking for netinet/in.h... yes
checking netdb.h usability... yes
checking netdb.h presence... yes
checking for netdb.h... yes
checking for string.h... (cached) yes
checking for strings.h... (cached) yes
checking sys/socket.h usability... yes
checking sys/socket.h presence... yes
checking for sys/socket.h... yes
checking for sys/types.h... (cached) yes
checking for sys/stat.h... (cached) yes
checking sys/param.h usability... yes
checking sys/param.h presence... yes
checking for sys/param.h... yes
checking fcntl.h usability... yes
checking fcntl.h presence... yes
checking for fcntl.h... yes
checking syslog.h usability... yes
checking syslog.h presence... yes
checking for syslog.h... yes
checking for unistd.h... (cached) yes
checking stdarg.h usability... yes
checking stdarg.h presence... yes
checking for stdarg.h... yes
checking errno.h usability... yes
checking errno.h presence... yes
checking for errno.h... yes
checking crypt.h usability... yes
checking crypt.h presence... yes
checking for crypt.h... yes
checking for stdbool.h that conforms to C99... yes
checking for _Bool... yes
checking for an ANSI C-conforming const... yes
checking for inline... inline
checking for size_t... yes
checking for working volatile... yes
checking for preprocessor stringizing operator... yes
checking for pid_t... yes
checking for working alloca.h... yes
checking for alloca... yes
checking for stdlib.h... (cached) yes
checking for GNU libc compatible malloc... yes
checking for working memcmp... yes
checking ELOOP availability... yes
checking EOVERFLOW availability... yes
checking for socket in -lsocket... no
checking for gethostbyname... yes
checking for gethostbyname in -lnsl... no
checking for inet_ntop... yes
checking for getaddrinfo... yes
checking for freeaddrinfo... yes
checking for strcasecmp... yes
checking for strdup... yes
checking PF_INET6 availability... yes
checking for struct sockaddr_in6... yes
checking for struct in6_addr... yes
checking for gethostbyname_r... yes
checking if gethostbyname_r() is part of glibc... yes
checking for char... yes
checking size of char... 1
checking for short... yes
checking size of short... 2
checking for int... yes
checking size of int... 4
checking for long... yes
checking size of long... 4
checking if /usr /usr/local /usr/mysql /opt/mysql is a mysql_config script... no
checking mysql_config availability in /usr/bin... yes
checking for mysql_real_query... yes
checking for mysql_real_escape_string... yes
checking for make_scrambled_password_323... yes
checking for pkg-config... /usr/bin/pkg-config
checking pkg-config is at least version 0.9.0... yes
checking pam_appl.h usability... yes
checking pam_appl.h presence... yes
checking for pam_appl.h... yes
checking pam_modules.h usability... yes
checking PAM_CONV_AGAIN availability... yes
checking PAM_INCOMPLETE availability... yes
checking PAM_NEW_AUTHTOK_REQD availability... yes
checking PAM_AUTHTOK_RECOVERY_ERR availability... yes
checking if the second argument of pam_get_user() takes const pointer... yes
checking if the third argument of pam_get_data() takes const pointer... yes
checking if the third argument of pam_get_item() takes const pointer... yes
checking if the second argument of pam_conv.conv() takes const pointer... no
checking if md5.h is derived from Cyrus SASL Version 1... no
checking md5.h usability... no
checking md5.h presence... no
checking for md5.h... no
checking if md5.h is Solaris's... no
checking for md5.h... (cached) no
checking for MD5Data... no
checking for crypt in -lcrypt... yes
checking for crypt... yes
configure: creating ./config.status
config.status: creating Makefile
config.status: creating pam_mysql.spec
config.status: creating config.h
config.status: config.h is unchanged
config.status: executing default-1 commands
make[1]: Entering directory `/usr/src/pam_mysql-0.7RC1'
/bin/sh ./mkinstalldirs /usr/lib/security
/bin/sh ./libtool --mode=install /usr/bin/install -c pam_mysql.la /usr/lib/secu
rity/pam_mysql.la
/usr/bin/install -c .libs/pam_mysql.so /usr/lib/security/pam_mysql.so
/usr/bin/install -c .libs/pam_mysql.lai /usr/lib/security/pam_mysql.la
libtool: install: warning: remember to run `libtool --finish /lib/security'
make[1]: Für das Ziel »install-data-am« ist nichts zu tun.
make[1]: Leaving directory `/usr/src/pam_mysql-0.7RC1'
Compiling source dependencies (start-stop-daemon (fix for SuSE))...
Compiling source dependencies (concurrent.jar)...

BUILD FAILED
/usr/src/concurrent/build.xml:45: Unable to find a javac compiler;
com.sun.tools.javac.Main is not on the classpath.
Perhaps JAVA_HOME does not point to the JDK.
It is currently set to "/usr/lib/jvm/java-1.6.0.u3.sr2-sun-1.6.0.u3/jre"

Total time: 1 second
cp: Aufruf von stat für „lib/concurrent.jar“ nicht möglich: Datei oder Verzeichn
is nicht gefunden
Compiling source dependencies (jdom.jar)...
[echo] ----------- JDOM 1.1 ------------

BUILD FAILED
/usr/src/jdom-1.1/build.xml:173: Unable to find a javac compiler;
com.sun.tools.javac.Main is not on the classpath.
Perhaps JAVA_HOME does not point to the JDK.
It is currently set to "/usr/lib/jvm/java-1.6.0.u3.sr2-sun-1.6.0.u3/jre"

Total time: 1 second
Compiling source dependencies (json.jar)...
? json-jdk15/build
? json-jdk15/lib

BUILD FAILED
/usr/src/json-jdk15/build.xml:34: Unable to find a javac compiler;
com.sun.tools.javac.Main is not on the classpath.
Perhaps JAVA_HOME does not point to the JDK.
It is currently set to "/usr/lib/jvm/java-1.6.0.u3.sr2-sun-1.6.0.u3/jre"

Total time: 0 seconds
cp: Aufruf von stat für „lib/json.jar“ nicht möglich: Datei oder Verzeichnis nic
ht gefunden
Linking distribution specific dependencies...ln: Erzeuge symbolische Verknüpfung
„/opt/open-xchange/lib/activation.jar“: Die Datei existiert bereits
ln: Erzeuge symbolische Verknüpfung „/opt/open-xchange/lib/commons-codec-1.3.jar
“: Die Datei existiert bereits
ln: Erzeuge symbolische Verknüpfung „/opt/open-xchange/lib/commons-httpclient-2.
0.2.jar“: Die Datei existiert bereits
ln: Erzeuge symbolische Verknüpfung „/opt/open-xchange/lib/commons-logging.jar“:
Die Datei existiert bereits
ln: Erzeuge symbolische Verknüpfung „/opt/open-xchange/lib/junit-4.1.jar“: Die D
atei existiert bereits
ln: Erzeuge symbolische Verknüpfung „/opt/open-xchange/lib/mysql-connector-java-
3.1.13-bin.jar“: Die Datei existiert bereits
ln: Erzeuge symbolische Verknüpfung „/opt/open-xchange/lib/servlet-api-2.4.jar“:
Die Datei existiert bereits
ln: Erzeuge symbolische Verknüpfung „/opt/open-xchange/lib/saxon8.jar“: Die Date
i existiert bereits
done.
Configuring services (apache2, cyrus, mysql, pam, sasl, postfix)..."jk" already
present
done.
Restarting services...
Starting service saslauthd done
Starting IMAP/POP3 service (cyrus-imapd) done
Starting service MySQL done
Apache is already running (/var/run/httpd2.pid) done
Configuring system user (open-xchange)...
groupadd: Group `open-xchange' already exists.
useradd: Account `open-xchange' already exists.
groupadd: Group `ssl-cert' already exists.
Building Open-Xchange Groupware...
Error occurred during initialization of VM
Could not reserve enough space for object heap
Could not create the Java virtual machine.
Building Open-Xchange Admindaemon...
Error occurred during initialization of VM
Could not reserve enough space for object heap
Could not create the Java virtual machine.
Building Open-Xchange Groupware GUI...

BUILD SUCCESSFUL
Total time: 17 seconds
Executing oxinstaller...
awk: Kommandozeile:1: Fatal: Kann Datei '/opt/open-xchange/etc/admindaemon/ox-ad
min-scriptconf.sh' nicht zum Lesen öffnen (Datei oder Verzeichnis nicht gefunden
).
awk: Kommandozeile:1: Fatal: Kann Datei '/opt/open-xchange/etc/groupware/ox-scri
ptconf.sh' nicht zum Lesen öffnen (Datei oder Verzeichnis nicht gefunden).
./hyperion-opensuse_103.sh: line 231: /opt/open-xchange/sbin/oxinstaller: Datei
oder Verzeichnis nicht gefunden
Buildfile: build.xml

copysrc:

compile:
[javac] Compiling 86 source files to /usr/src/open-xchange-admin-gui-ee/clas
ses

BUILD FAILED
/usr/src/open-xchange-admin-gui-ee/build.xml:75: Unable to find a javac compiler
;
com.sun.tools.javac.Main is not on the classpath.
Perhaps JAVA_HOME does not point to the JDK.
It is currently set to "/usr/lib/jvm/java-1.6.0.u3.sr2-sun-1.6.0.u3/jre"

Total time: 1 second
Buildfile: build.xml

install:

css:

html:

build page:

build page:

build page:

lang:
[copy] Copying 1 file to /usr/src/open-xchange-admin-gui-ee-ajax/lang

all:

deploy:
[copy] Copying 2 files to /srv/www/htdocs/ox/admin

BUILD SUCCESSFUL
Total time: 3 seconds
Buildfile: build.xml

install:
[copy] Copying 6 files to /opt/open-xchange/oxadmin-templates

BUILD SUCCESSFUL
Total time: 0 seconds
Creating startup scripts...open-xchange-admin: unknown service
Line already in /etc/init.d/.depend.start, nothing to do...
done.
Creating Groupware user... ./hyperion-opensuse_103.sh: line 272: /opt/open-xchan
ge/sbin/createuser: Datei oder Verzeichnis nicht gefunden
Open-Xchange Groupware Daemon: /opt/open-xchange/etc/groupware/oxfunctions.sh mi
ssing, exiting
Installation complete.

Now log in using the following credentials:
User: testuser
Pass: secret

Note that all passwords are potentially unsave ('secret')
Domain change will require some manual configuration.

comsrv01:/home/sysadm/Documents #


















Open-Xchange Community Edition (Hyperion) Installation Script
For OpenSuSE 10.3

This installation package contains 3rd party components.
YOU MUST AGREE TO ALL OF THE LICENSES USED BY THE COMPONENTS OF THIS PACKAGE TO
COMPILE THE SOFTWARE. DO NOT CONTINUE IF YOU DO NOT AGREE TO ANY OF THE LICENSES
USED BY THE COMPONENTS OF THIS PACKAGE.

Look at /tmp/hyperion-install/license for the specific license document.

sun.txt - Sun Microsystems Inc. ENTITLEMENT for SOFTWARE
- mail.jar (Sun JavaMail 1.4)
apache.txt - Apache License Version 2.0, January 2004
- commons-cli-1.0.jar (Apache Commons CLI)
- commons-io.jar (Apache Commons IO)
- commons-fileupload.jar (Apache Commons Fileupload)
- jcs-1.2.7.9.2.jar (Java Caching System)
- spring-beans_1.2.7.jar (Spring Framework)
- spring-core_1.2.7.jar (Spring Framework)
epl.txt - Eclipse Public License - v 1.0
- org.eclipse.osgi_3.2.2.ox.jar (Equinox OSGI)
gnu-gplv2.txt - GNU GENERAL PUBLIC LICENSE Version 2, June 1991
- Open-Xchange Server Components
(open-xchange, open-xchange-admin*)
- NSS MySQL library (http://www.nongnu.org/nss-mysql/)
- PAM-MySQL backend (http://pam-mysql.sourceforge.net/)
gnu-gplv3.txt - GNU GENERAL PUBLIC LICENSE Version 3, 29 June 2007
- tnef.jar (Java TNEF)
cc-byncsa.txt - Creative Commons Attribution-NonCommercial-ShareAlike 2.5
- Digital content and Javascript code of the Open-Xchange GUI Frontend
(open-xchange-gui)
json.txt - JSON.org license
- json.jar (JavaScript Object Notation)
xerox.txt - Xerox Corporation
- jcs-1.2.7.9.2.jar (Java Caching System)

Press [y] to agree the licenses, press [n] to decline. [y/n] y
Downloading required packages...
Depending on your internet connection, this may take a while.
  • Füge Repository 'openSuSE-oss' hinzu
Ein Repository mit dem Namen 'openSuSE-oss' existiert bereits. Bitte wählen Sie
einen anderen Alias.
  • Füge Repository 'openSuSE-non-oss' hinzu
Ein Repository mit dem Namen 'openSuSE-non-oss' existiert bereits. Bitte wählen
Sie einen anderen Alias.
  • Lese Cache für Repository 'openSuSE-non-oss'
  • Lese Cache für Repository 'openSuSE-oss'
  • Lese Cache für Repository 'openSUSE BuildService - OpenOffice.org'
  • Lese Cache für Repository 'openSUSE BuildService - Mozilla'
  • Lese Cache für Repository 'Facktory'
  • Lese Cache für Repository 'openSUSE BuildService - Datenbanken'
  • Lese Cache für Repository 'openSUSE BuildService - KDE:Community'
  • Lese Cache für Repository 'Haupt-Repository (Nicht-OSS)'
  • Lese Cache für Repository 'openSUSE BuildService - PHP'
  • Lese Cache für Repository 'Haupt-Update Repository'
  • Lese Cache für Repository 'openSUSE-10.3-FTP 10.3'
  • Lese Cache für Repository 'Packman Repository'
  • Lese Cache für Repository 'openSUSE BuildService - KDE:Backports'
  • Lese Cache für Repository 'openSUSE BuildService - Mail Server'
  • Lese Cache für Repository 'VideoLan Repository'
  • Lese Cache für Repository 'Haupt-Repository (Opensource Software - OSS)'
  • Lese installierte Pakete [100%]

Paket 'java-1_6_0-sun' wird übersprungen: bereits installiert
Paket 'java-1_6_0-sun-devel' wird übersprungen: bereits installiert
Paket 'mysql' wird übersprungen: bereits installiert
Paket 'cyrus-imapd' wird übersprungen: bereits installiert
Paket 'ant' wird übersprungen: bereits installiert
Paket 'apache2' wird übersprungen: bereits installiert
Paket 'apache2-mod_jk' wird übersprungen: bereits installiert
Paket 'postfix-mysql' wird übersprungen: bereits installiert
Paket 'cyrus-sasl' wird übersprungen: bereits installiert
Paket 'cyrus-sasl-saslauthd' wird übersprungen: bereits installiert
Paket 'gettext' wird übersprungen: bereits installiert
Paket 'gettext-devel' wird übersprungen: bereits installiert
Paket 'cvs' wird übersprungen: bereits installiert
Paket 'ant-trax' wird übersprungen: bereits installiert
Paket 'ant-apache-regexp' wird übersprungen: bereits installiert
Paket 'ant-nodeps' wird übersprungen: bereits installiert
Paket 'make' wird übersprungen: bereits installiert
Paket 'gcc' wird übersprungen: bereits installiert
Paket 'automake' wird übersprungen: bereits installiert
Paket 'autoconf' wird übersprungen: bereits installiert
Paket 'gcc-c++' wird übersprungen: bereits installiert
Paket 'libmysqlclient-devel' wird übersprungen: bereits installiert
Paket 'pam-devel' wird übersprungen: bereits installiert
Paket 'gnu-jaf' wird übersprungen: bereits installiert
Paket 'jakarta-commons-codec' wird übersprungen: bereits installiert
Paket 'jakarta-commons-httpclient3' wird übersprungen: bereits installiert
Paket 'jakarta-commons-logging' wird übersprungen: bereits installiert
Paket 'junit' wird übersprungen: bereits installiert
Paket 'mysql-connector-java' wird übersprungen: bereits installiert
Paket 'saxon' wird übersprungen: bereits installiert
Paket 'servletapi4' wird übersprungen: bereits installiert
Keine auszuführenden Aktionen.
Creating Open-Xchange directories... done.
CVS checkout required Open-Xchange repositories...
+ -r bf_6_4 open-xchange ... done.
+ -r bf_6_4 open-xchange-admin ... done.
+ open-xchange-admin-console-ee ... done.
+ -r bf_6_4 open-xchange-admin-plugin-imap ... done.
+ -r bf_6_4 open-xchange-admin-plugin-mail ... done.
+ -r bf_6_4 open-xchange-admin-plugin-mailfilter ... done.
+ -r bf_6_4 open-xchange-admin-plugin-context_light ... done.
+ -r bf_6_4 open-xchange-admin-plugin-ca_mgmt_simple ... done.
+ -r bf_6_4 open-xchange-admin-plugin-osconfig ... done.
+ -r bf_6_4 open-xchange-admin-plugin-services ... done.
+ -r bf_6_4 open-xchange-admin-plugin-sw-update ... done.
+ -r bf_6_4 open-xchange-admin-plugin-backup ... done.
+ -r bf_6_4 open-xchange-gui ... done.
+ open-xchange-admin-gui-ee ...? open-xchange-admin-gui-ee/tmpsrc
done.
+ open-xchange-admin-gui-ee-ajax ... done.
+ open-xchange-admin-gui-ee-templates ... done.
+ ...cvs [checkout aborted]: must specify at least one module or directory
done.
+ ...cvs [checkout aborted]: must specify at least one module or directory
done.
+ ...cvs [checkout aborted]: must specify at least one module or directory
done.
Installing binary dependencies... done.
Compiling source dependencies (nss-mysql)...
checking for a BSD-compatible install... /usr/bin/install -c
checking whether build environment is sane... yes
checking for gawk... gawk
checking whether make sets $(MAKE)... yes
configure: Defaulting configuration directory to "/etc"
checking build system type... i686-pc-linux-gnu
checking host system type... i686-pc-linux-gnu
checking whether to enable maintainer-specific portions of Makefiles... no
checking for gcc... gcc
checking for C compiler default output file name... a.out
checking whether the C compiler works... yes
checking whether we are cross compiling... no
checking for suffix of executables...
checking for suffix of object files... o
checking whether we are using the GNU C compiler... yes
checking whether gcc accepts -g... yes
checking for gcc option to accept ANSI C... none needed
checking for style of include used by make... GNU
checking dependency style of gcc... gcc3
checking for a BSD-compatible install... /usr/bin/install -c
checking whether ln -s works... yes
checking for gawk... (cached) gawk
checking for a sed that does not truncate output... /usr/bin/sed
checking for egrep... grep -E
checking for ld used by gcc... /usr/i586-suse-linux/bin/ld
checking if the linker (/usr/i586-suse-linux/bin/ld) is GNU ld... yes
checking for /usr/i586-suse-linux/bin/ld option to reload object files... -r
checking for BSD-compatible nm... /usr/bin/nm -B
checking how to recognise dependent libraries... pass_all
checking how to run the C preprocessor... gcc -E
checking for ANSI C header files... yes
checking for sys/types.h... yes
checking for sys/stat.h... yes
checking for stdlib.h... yes
checking for string.h... yes
checking for memory.h... yes
checking for strings.h... yes
checking for inttypes.h... yes
checking for stdint.h... yes
checking for unistd.h... yes
checking dlfcn.h usability... yes
checking dlfcn.h presence... yes
checking for dlfcn.h... yes
checking for g++... g++
checking whether we are using the GNU C++ compiler... yes
checking whether g++ accepts -g... yes
checking dependency style of g++... gcc3
checking how to run the C++ preprocessor... g++ -E
checking for g77... no
checking for f77... no
checking for xlf... no
checking for frt... no
checking for pgf77... no
checking for fort77... no
checking for fl32... no
checking for af77... no
checking for f90... no
checking for xlf90... no
checking for pgf90... no
checking for epcf90... no
checking for f95... no
checking for fort... no
checking for xlf95... no
checking for ifc... no
checking for efc... no
checking for pgf95... no
checking for lf95... no
checking for gfortran... no
checking whether we are using the GNU Fortran 77 compiler... no
checking whether accepts -g... no
checking the maximum length of command line arguments... 32768
checking command to parse /usr/bin/nm -B output from gcc object... ok
checking for objdir... .libs
checking for ar... ar
checking for ranlib... ranlib
checking for strip... strip
checking if gcc static flag works... yes
checking if gcc supports -fno-rtti -fno-exceptions... no
checking for gcc option to produce PIC... -fPIC
checking if gcc PIC flag -fPIC works... yes
checking if gcc supports -c -o file.o... yes
checking whether the gcc linker (/usr/i586-suse-linux/bin/ld) supports shared li
braries... yes
checking whether -lc should be explicitly linked in... no
checking dynamic linker characteristics... GNU/Linux ld.so
checking how to hardcode library paths into programs... immediate
checking whether stripping libraries is possible... yes
checking if libtool supports shared libraries... yes
checking whether to build shared libraries... yes
checking whether to build static libraries... no
configure: creating libtool
checking for pthread_mutex_lock in -lpthread... yes
checking for zlibVersion in -lz... yes
checking Mysql installation directory... lib = /usr/lib/mysql, include = /usr/i
nclude/mysql
checking for mysql_real_connect in -lmysqlclient_r... yes
checking mysql.h usability... yes
checking mysql.h presence... yes
checking for mysql.h... yes
checking for ANSI C header files... (cached) yes
checking for stdlib.h... (cached) yes
checking for string.h... (cached) yes
checking syslog.h usability... yes
checking syslog.h presence... yes
checking for syslog.h... yes
checking for unistd.h... (cached) yes
checking nsswitch.h usability... no
checking nsswitch.h presence... no
checking for nsswitch.h... no
checking shadow.h usability... yes
checking shadow.h presence... yes
checking for shadow.h... yes
checking signal.h usability... yes
checking signal.h presence... yes
checking for signal.h... yes
checking pthread.h usability... yes
checking pthread.h presence... yes
checking for pthread.h... yes
checking for an ANSI C-conforming const... yes
checking for inline... inline
checking for size_t... yes
checking for uid_t in sys/types.h... yes
checking for gid_t... yes
checking whether lstat dereferences a symlink specified with a trailing slash...
yes
checking whether stat accepts an empty string... no
checking for endgrent... yes
checking for endpwent... yes
checking for getspnam... yes
checking for memset... yes
checking for strchr... yes
checking for strdup... yes
checking for strerror... yes
checking for strtol... yes
checking for vasprintf... yes
checking for sigwait... yes
checking for mysql_real_escape_string... yes
configure: creating ./config.status
config.status: creating Makefile
config.status: creating tests/Makefile
config.status: creating src/Makefile
config.status: creating src/config.h
config.status: src/config.h is unchanged
config.status: executing depfiles commands
Making all in tests
make[1]: Entering directory `/usr/src/nss-mysql-1.0/tests'
make[1]: Für das Ziel »all« ist nichts zu tun.
make[1]: Leaving directory `/usr/src/nss-mysql-1.0/tests'
Making all in src
make[1]: Entering directory `/usr/src/nss-mysql-1.0/src'
make all-am
make[2]: Entering directory `/usr/src/nss-mysql-1.0/src'
make[2]: Leaving directory `/usr/src/nss-mysql-1.0/src'
make[1]: Leaving directory `/usr/src/nss-mysql-1.0/src'
make[1]: Entering directory `/usr/src/nss-mysql-1.0'
make[1]: Für das Ziel »all-am« ist nichts zu tun.
make[1]: Leaving directory `/usr/src/nss-mysql-1.0'
Making install in tests
make[1]: Entering directory `/usr/src/nss-mysql-1.0/tests'
make[2]: Entering directory `/usr/src/nss-mysql-1.0/tests'
make[2]: Für das Ziel »install-exec-am« ist nichts zu tun.
make[2]: Für das Ziel »install-data-am« ist nichts zu tun.
make[2]: Leaving directory `/usr/src/nss-mysql-1.0/tests'
make[1]: Leaving directory `/usr/src/nss-mysql-1.0/tests'
Making install in src
make[1]: Entering directory `/usr/src/nss-mysql-1.0/src'
make[2]: Entering directory `/usr/src/nss-mysql-1.0/src'
test -z "/usr/lib" || mkdir -p -- "/usr/lib"
/bin/sh ../libtool --mode=install /usr/bin/install -c 'libnss_mysql.la' '/usr/
lib/libnss_mysql.la'
/usr/bin/install -c .libs/libnss_mysql.so.2.0.0 /usr/lib/libnss_mysql.so.2.0.0
(cd /usr/lib && rm -f libnss_mysql.so.2 && ln -s libnss_mysql.so.2.0.0 libnss_my
sql.so.2)
(cd /usr/lib && rm -f libnss_mysql.so && ln -s libnss_mysql.so.2.0.0 libnss_mysq
l.so)
/usr/bin/install -c .libs/libnss_mysql.lai /usr/lib/libnss_mysql.la
PATH="$PATH:/sbin" ldconfig -n /usr/lib
Libraries have been installed in:
/usr/lib

If you ever happen to want to link against installed libraries
in a given directory, LIBDIR, you must either use libtool, and
specify the full pathname of the library, or use the `-LLIBDIR'
flag during linking and do at least one of the following:
- add LIBDIR to the `LD_LIBRARY_PATH' environment variable
during execution
- add LIBDIR to the `LD_RUN_PATH' environment variable
during linking
- use the `-Wl,--rpath -Wl,LIBDIR' linker flag
- have your system administrator add LIBDIR to `/etc/ld.so.conf'

See any operating system documentation about shared libraries for
more information, such as the ld(1) and ld.so(8) manual pages.
make[2]: Für das Ziel »install-data-am« ist nichts zu tun.
make[2]: Leaving directory `/usr/src/nss-mysql-1.0/src'
make[1]: Leaving directory `/usr/src/nss-mysql-1.0/src'
make[1]: Entering directory `/usr/src/nss-mysql-1.0'
make[2]: Entering directory `/usr/src/nss-mysql-1.0'
make[2]: Für das Ziel »install-exec-am« ist nichts zu tun.
if [ ! -d /etc ] ; then mkdir -p /etc ; fi
if [ ! -e /etc/nss-mysql.conf ] ; then /usr/bin/install -c -m 644 ./nss-mysql.co
nf /etc/nss-mysql.conf ; fi
if [ ! -e /etc/nss-mysql-root.conf ] ; then /usr/bin/install -c -m 644 -m 600 ./
nss-mysql-root.conf /etc/nss-mysql-root.conf ; fi
make[2]: Leaving directory `/usr/src/nss-mysql-1.0'
make[1]: Leaving directory `/usr/src/nss-mysql-1.0'
Compiling source dependencies (pam_mysql)...
checking for a BSD-compatible install... /usr/bin/install -c
checking whether build environment is sane... yes
checking whether make sets $(MAKE)... yes
checking for working aclocal-1.4... missing
checking for working autoconf... found
checking for working automake-1.4... missing
checking for working autoheader... found
checking for working makeinfo... missing
checking whether to enable maintainer-specific portions of Makefiles... no
checking for bison... no
checking for byacc... no
checking for g++... g++
checking for C++ compiler default output file name... a.out
checking whether the C++ compiler works... yes
checking whether we are cross compiling... no
checking for suffix of executables...
checking for suffix of object files... o
checking whether we are using the GNU C++ compiler... yes
checking whether g++ accepts -g... yes
checking for gcc... gcc
checking whether we are using the GNU C compiler... yes
checking whether gcc accepts -g... yes
checking for gcc option to accept ANSI C... none needed
checking how to run the C preprocessor... gcc -E
checking whether ln -s works... yes
checking whether make sets $(MAKE)... (cached) yes
checking for a BSD-compatible install... /usr/bin/install -c
checking build system type... i686-pc-linux-gnu
checking host system type... i686-pc-linux-gnu
checking for a sed that does not truncate output... /usr/bin/sed
checking for egrep... grep -E
checking for ld used by gcc... /usr/i586-suse-linux/bin/ld
checking if the linker (/usr/i586-suse-linux/bin/ld) is GNU ld... yes
checking for /usr/i586-suse-linux/bin/ld option to reload object files... -r
checking for BSD-compatible nm... /usr/bin/nm -B
checking how to recognise dependent libraries... pass_all
checking for ANSI C header files... yes
checking for sys/types.h... yes
checking for sys/stat.h... yes
checking for stdlib.h... yes
checking for string.h... yes
checking for memory.h... yes
checking for strings.h... yes
checking for inttypes.h... yes
checking for stdint.h... yes
checking for unistd.h... yes
checking dlfcn.h usability... yes
checking dlfcn.h presence... yes
checking for dlfcn.h... yes
checking how to run the C++ preprocessor... g++ -E
checking for g77... no
checking for f77... no
checking for xlf... no
checking for frt... no
checking for pgf77... no
checking for fort77... no
checking for fl32... no
checking for af77... no
checking for f90... no
checking for xlf90... no
checking for pgf90... no
checking for epcf90... no
checking for f95... no
checking for fort... no
checking for xlf95... no
checking for ifc... no
checking for efc... no
checking for pgf95... no
checking for lf95... no
checking for gfortran... no
checking whether we are using the GNU Fortran 77 compiler... no
checking whether accepts -g... no
checking the maximum length of command line arguments... 32768
checking command to parse /usr/bin/nm -B output from gcc object... ok
checking for objdir... .libs
checking for ar... ar
checking for ranlib... ranlib
checking for strip... strip
checking if gcc static flag works... yes
checking if gcc supports -fno-rtti -fno-exceptions... no
checking for gcc option to produce PIC... -fPIC
checking if gcc PIC flag -fPIC works... yes
checking if gcc supports -c -o file.o... yes
checking whether the gcc linker (/usr/i586-suse-linux/bin/ld) supports shared li
braries... yes
checking whether -lc should be explicitly linked in... no
checking dynamic linker characteristics... cat: /etc/ld.so.conf.d/*.conf: No suc
h file or directory
GNU/Linux ld.so
checking how to hardcode library paths into programs... immediate
checking whether stripping libraries is possible... yes
checking if libtool supports shared libraries... yes
checking whether to build shared libraries... yes
checking whether to build static libraries... no
configure: creating libtool
appending configuration tag "CXX" to libtool
checking for ld used by g++... /usr/i586-suse-linux/bin/ld
checking if the linker (/usr/i586-suse-linux/bin/ld) is GNU ld... yes
checking whether the g++ linker (/usr/i586-suse-linux/bin/ld) supports shared li
braries... yes
checking for g++ option to produce PIC... -fPIC
checking if g++ PIC flag -fPIC works... yes
checking if g++ supports -c -o file.o... yes
checking whether the g++ linker (/usr/i586-suse-linux/bin/ld) supports shared li
braries... yes
checking dynamic linker characteristics... cat: /etc/ld.so.conf.d/*.conf: No suc
h file or directory
GNU/Linux ld.so
checking how to hardcode library paths into programs... immediate
checking whether stripping libraries is possible... yes
appending configuration tag "F77" to libtool
checking for ANSI C header files... (cached) yes
checking arpa/inet.h usability... yes
checking arpa/inet.h presence... yes
checking for arpa/inet.h... yes
checking netinet/in.h usability... yes
checking netinet/in.h presence... yes
checking for netinet/in.h... yes
checking netdb.h usability... yes
checking netdb.h presence... yes
checking for netdb.h... yes
checking for string.h... (cached) yes
checking for strings.h... (cached) yes
checking sys/socket.h usability... yes
checking sys/socket.h presence... yes
checking for sys/socket.h... yes
checking for sys/types.h... (cached) yes
checking for sys/stat.h... (cached) yes
checking sys/param.h usability... yes
checking sys/param.h presence... yes
checking for sys/param.h... yes
checking fcntl.h usability... yes
checking fcntl.h presence... yes
checking for fcntl.h... yes
checking syslog.h usability... yes
checking syslog.h presence... yes
checking for syslog.h... yes
checking for unistd.h... (cached) yes
checking stdarg.h usability... yes
checking stdarg.h presence... yes
checking for stdarg.h... yes
checking errno.h usability... yes
checking errno.h presence... yes
checking for errno.h... yes
checking crypt.h usability... yes
checking crypt.h presence... yes
checking for crypt.h... yes
checking for stdbool.h that conforms to C99... yes
checking for _Bool... yes
checking for an ANSI C-conforming const... yes
checking for inline... inline
checking for size_t... yes
checking for working volatile... yes
checking for preprocessor stringizing operator... yes
checking for pid_t... yes
checking for working alloca.h... yes
checking for alloca... yes
checking for stdlib.h... (cached) yes
checking for GNU libc compatible malloc... yes
checking for working memcmp... yes
checking ELOOP availability... yes
checking EOVERFLOW availability... yes
checking for socket in -lsocket... no
checking for gethostbyname... yes
checking for gethostbyname in -lnsl... no
checking for inet_ntop... yes
checking for getaddrinfo... yes
checking for freeaddrinfo... yes
checking for strcasecmp... yes
checking for strdup... yes
checking PF_INET6 availability... yes
checking for struct sockaddr_in6... yes
checking for struct in6_addr... yes
checking for gethostbyname_r... yes
checking if gethostbyname_r() is part of glibc... yes
checking for char... yes
checking size of char... 1
checking for short... yes
checking size of short... 2
checking for int... yes
checking size of int... 4
checking for long... yes
checking size of long... 4
checking if /usr /usr/local /usr/mysql /opt/mysql is a mysql_config script... no
checking mysql_config availability in /usr/bin... yes
checking for mysql_real_query... yes
checking for mysql_real_escape_string... yes
checking for make_scrambled_password_323... yes
checking for pkg-config... /usr/bin/pkg-config
checking pkg-config is at least version 0.9.0... yes
checking pam_appl.h usability... yes
checking pam_appl.h presence... yes
checking for pam_appl.h... yes
checking pam_modules.h usability... yes
checking PAM_CONV_AGAIN availability... yes
checking PAM_INCOMPLETE availability... yes
checking PAM_NEW_AUTHTOK_REQD availability... yes
checking PAM_AUTHTOK_RECOVERY_ERR availability... yes
checking if the second argument of pam_get_user() takes const pointer... yes
checking if the third argument of pam_get_data() takes const pointer... yes
checking if the third argument of pam_get_item() takes const pointer... yes
checking if the second argument of pam_conv.conv() takes const pointer... no
checking if md5.h is derived from Cyrus SASL Version 1... no
checking md5.h usability... no
checking md5.h presence... no
checking for md5.h... no
checking if md5.h is Solaris's... no
checking for md5.h... (cached) no
checking for MD5Data... no
checking for crypt in -lcrypt... yes
checking for crypt... yes
configure: creating ./config.status
config.status: creating Makefile
config.status: creating pam_mysql.spec
config.status: creating config.h
config.status: config.h is unchanged
config.status: executing default-1 commands
make[1]: Entering directory `/usr/src/pam_mysql-0.7RC1'
/bin/sh ./mkinstalldirs /usr/lib/security
/bin/sh ./libtool --mode=install /usr/bin/install -c pam_mysql.la /usr/lib/secu
rity/pam_mysql.la
/usr/bin/install -c .libs/pam_mysql.so /usr/lib/security/pam_mysql.so
/usr/bin/install -c .libs/pam_mysql.lai /usr/lib/security/pam_mysql.la
libtool: install: warning: remember to run `libtool --finish /lib/security'
make[1]: Für das Ziel »install-data-am« ist nichts zu tun.
make[1]: Leaving directory `/usr/src/pam_mysql-0.7RC1'
Compiling source dependencies (start-stop-daemon (fix for SuSE))...
Compiling source dependencies (concurrent.jar)...

BUILD FAILED
/usr/src/concurrent/build.xml:45: Unable to find a javac compiler;
com.sun.tools.javac.Main is not on the classpath.
Perhaps JAVA_HOME does not point to the JDK.
It is currently set to "/usr/lib/jvm/java-1.6.0.u3.sr2-sun-1.6.0.u3/jre"

Total time: 1 second
cp: Aufruf von stat für „lib/concurrent.jar“ nicht möglich: Datei oder Verzeichn
is nicht gefunden
Compiling source dependencies (jdom.jar)...
[echo] ----------- JDOM 1.1 ------------

BUILD FAILED
/usr/src/jdom-1.1/build.xml:173: Unable to find a javac compiler;
com.sun.tools.javac.Main is not on the classpath.
Perhaps JAVA_HOME does not point to the JDK.
It is currently set to "/usr/lib/jvm/java-1.6.0.u3.sr2-sun-1.6.0.u3/jre"

Total time: 1 second
Compiling source dependencies (json.jar)...
? json-jdk15/build
? json-jdk15/lib

BUILD FAILED
/usr/src/json-jdk15/build.xml:34: Unable to find a javac compiler;
com.sun.tools.javac.Main is not on the classpath.
Perhaps JAVA_HOME does not point to the JDK.
It is currently set to "/usr/lib/jvm/java-1.6.0.u3.sr2-sun-1.6.0.u3/jre"

Total time: 0 seconds
cp: Aufruf von stat für „lib/json.jar“ nicht möglich: Datei oder Verzeichnis nic
ht gefunden
Linking distribution specific dependencies...ln: Erzeuge symbolische Verknüpfung
„/opt/open-xchange/lib/activation.jar“: Die Datei existiert bereits
ln: Erzeuge symbolische Verknüpfung „/opt/open-xchange/lib/commons-codec-1.3.jar
“: Die Datei existiert bereits
ln: Erzeuge symbolische Verknüpfung „/opt/open-xchange/lib/commons-httpclient-2.
0.2.jar“: Die Datei existiert bereits
ln: Erzeuge symbolische Verknüpfung „/opt/open-xchange/lib/commons-logging.jar“:
Die Datei existiert bereits
ln: Erzeuge symbolische Verknüpfung „/opt/open-xchange/lib/junit-4.1.jar“: Die D
atei existiert bereits
ln: Erzeuge symbolische Verknüpfung „/opt/open-xchange/lib/mysql-connector-java-
3.1.13-bin.jar“: Die Datei existiert bereits
ln: Erzeuge symbolische Verknüpfung „/opt/open-xchange/lib/servlet-api-2.4.jar“:
Die Datei existiert bereits
ln: Erzeuge symbolische Verknüpfung „/opt/open-xchange/lib/saxon8.jar“: Die Date
i existiert bereits
done.
Configuring services (apache2, cyrus, mysql, pam, sasl, postfix)..."jk" already
present
done.
Restarting services...
Starting service saslauthd done
Starting IMAP/POP3 service (cyrus-imapd) done
Starting service MySQL done
Apache is already running (/var/run/httpd2.pid) done
Configuring system user (open-xchange)...
groupadd: Group `open-xchange' already exists.
useradd: Account `open-xchange' already exists.
groupadd: Group `ssl-cert' already exists.
Building Open-Xchange Groupware...
Error occurred during initialization of VM
Could not reserve enough space for object heap
Could not create the Java virtual machine.
Building Open-Xchange Admindaemon...
Error occurred during initialization of VM
Could not reserve enough space for object heap
Could not create the Java virtual machine.
Building Open-Xchange Groupware GUI...

BUILD SUCCESSFUL
Total time: 17 seconds
Executing oxinstaller...
awk: Kommandozeile:1: Fatal: Kann Datei '/opt/open-xchange/etc/admindaemon/ox-ad
min-scriptconf.sh' nicht zum Lesen öffnen (Datei oder Verzeichnis nicht gefunden
).
awk: Kommandozeile:1: Fatal: Kann Datei '/opt/open-xchange/etc/groupware/ox-scri
ptconf.sh' nicht zum Lesen öffnen (Datei oder Verzeichnis nicht gefunden).
./hyperion-opensuse_103.sh: line 231: /opt/open-xchange/sbin/oxinstaller: Datei
oder Verzeichnis nicht gefunden
Buildfile: build.xml

copysrc:

compile:
[javac] Compiling 86 source files to /usr/src/open-xchange-admin-gui-ee/clas
ses

BUILD FAILED
/usr/src/open-xchange-admin-gui-ee/build.xml:75: Unable to find a javac compiler
;
com.sun.tools.javac.Main is not on the classpath.
Perhaps JAVA_HOME does not point to the JDK.
It is currently set to "/usr/lib/jvm/java-1.6.0.u3.sr2-sun-1.6.0.u3/jre"

Total time: 1 second
Buildfile: build.xml

install:

css:

html:

build page:

build page:

build page:

lang:
[copy] Copying 1 file to /usr/src/open-xchange-admin-gui-ee-ajax/lang

all:

deploy:
[copy] Copying 2 files to /srv/www/htdocs/ox/admin

BUILD SUCCESSFUL
Total time: 3 seconds
Buildfile: build.xml

install:
[copy] Copying 6 files to /opt/open-xchange/oxadmin-templates

BUILD SUCCESSFUL
Total time: 0 seconds
Creating startup scripts...open-xchange-admin: unknown service
Line already in /etc/init.d/.depend.start, nothing to do...
done.
Creating Groupware user... ./hyperion-opensuse_103.sh: line 272: /opt/open-xchan
ge/sbin/createuser: Datei oder Verzeichnis nicht gefunden
Open-Xchange Groupware Daemon: /opt/open-xchange/etc/groupware/oxfunctions.sh mi
ssing, exiting
Installation complete.

Now log in using the following credentials:
User: testuser
Pass: secret

Note that all passwords are potentially unsave ('secret')
Domain change will require some manual configuration.

comsrv01:/home/sysadm/Documents #
Neuester Wissensbeitrag
Ähnliche Inhalte
Windows Netzwerk
Windows 10 RDP geht nicht (18)

Frage von Fiasko zum Thema Windows Netzwerk ...

Windows 10
gelöst Windows 10 Privatsphäre (3)

Frage von Patrick-IT zum Thema Windows 10 ...

Heiß diskutierte Inhalte
Windows Userverwaltung
Ausgeschiedene Mitarbeiter im Unternehmen - was tun mit den AD Konten? (33)

Frage von patz223 zum Thema Windows Userverwaltung ...

LAN, WAN, Wireless
FritzBox, zwei Server, verschiedene Netze (21)

Frage von DavidGl zum Thema LAN, WAN, Wireless ...

Viren und Trojaner
Aufgepasst: Neue Ransomware Goldeneye verbreitet sich rasant (20)

Link von Penny.Cilin zum Thema Viren und Trojaner ...