Top-Themen

Aktuelle Themen (A bis Z)

Administrator.de FeedbackApache ServerAppleAssemblerAudioAusbildungAuslandBackupBasicBatch & ShellBenchmarksBibliotheken & ToolkitsBlogsCloud-DiensteClusterCMSCPU, RAM, MainboardsCSSC und C++DatenbankenDatenschutzDebianDigitiales FernsehenDNSDrucker und ScannerDSL, VDSLE-BooksE-BusinessE-MailEntwicklungErkennung und -AbwehrExchange ServerFestplatten, SSD, RaidFirewallFlatratesGoogle AndroidGrafikGrafikkarten & MonitoreGroupwareHardwareHosting & HousingHTMLHumor (lol)Hyper-VIconsIDE & EditorenInformationsdiensteInstallationInstant MessagingInternetInternet DomäneniOSISDN & AnaloganschlüsseiTunesJavaJavaScriptKiXtartKVMLAN, WAN, WirelessLinuxLinux DesktopLinux NetzwerkLinux ToolsLinux UserverwaltungLizenzierungMac OS XMicrosoftMicrosoft OfficeMikroTik RouterOSMonitoringMultimediaMultimedia & ZubehörNetzwerkeNetzwerkgrundlagenNetzwerkmanagementNetzwerkprotokolleNotebook & ZubehörNovell NetwareOff TopicOpenOffice, LibreOfficeOutlook & MailPapierkorbPascal und DelphiPeripheriegerätePerlPHPPythonRechtliche FragenRedHat, CentOS, FedoraRouter & RoutingSambaSAN, NAS, DASSchriftartenSchulung & TrainingSEOServerServer-HardwareSicherheitSicherheits-ToolsSicherheitsgrundlagenSolarisSonstige SystemeSoziale NetzwerkeSpeicherkartenStudentenjobs & PraktikumSuche ProjektpartnerSuseSwitche und HubsTipps & TricksTK-Netze & GeräteUbuntuUMTS, EDGE & GPRSUtilitiesVB for ApplicationsVerschlüsselung & ZertifikateVideo & StreamingViren und TrojanerVirtualisierungVisual StudioVmwareVoice over IPWebbrowserWebentwicklungWeiterbildungWindows 7Windows 8Windows 10Windows InstallationWindows MobileWindows NetzwerkWindows ServerWindows SystemdateienWindows ToolsWindows UpdateWindows UserverwaltungWindows VistaWindows XPXenserverXMLZusammenarbeit

Probleme bei der Installation von Taper

Mitglied: Trubadix

Trubadix (Level 1) - Jetzt verbinden

04.10.2006 um 20:15 Uhr, 2690 Aufrufe

Hallo,
beim Versuch Taper auf meinem Linux System zu installieren, erhalte ich immer nach dem make all die folgenden Fehlermeldungen, mit denen ich nicht all zu viel anfangen kann. Falls jemand Erfahrungen mit dem beschriebenem Problem oder Erfahrungen mit der Installation von Taper hat, wäre ich sehr anjbar, wenn er ese hier posten würde.

debian:~/taper/taper-6.9b# make all
gcc -O6 -fno-strength-reduce -Wall -pipe -DLINUX -D_GNU_SOURCE -Dlint -DTRIPLE_BUFFER -DGLIBC_2 -DBSD_SIGNALS -I/usr/include/ncurses -o vars.o -c vars.c
In Datei, eingefügt von vars.c:17:
taper.h:40:20: curses.h: Datei oder Verzeichnis nicht gefunden
taper.h:41:18: form.h: Datei oder Verzeichnis nicht gefunden
In Datei, eingefügt von taper.h:43,
von vars.c:17:
select_box.h:15:20: curses.h: Datei oder Verzeichnis nicht gefunden
select_box.h:16:18: form.h: Datei oder Verzeichnis nicht gefunden
In file included from taper.h:43,
from vars.c:17:
select_box.h:60: error: Syntaxfehler before '*' token
select_box.h:60: Warnung: type defaults to `int' in declaration of `my_newwin'
select_box.h:60: Warnung: data definition has no type or storage class
select_box.h:61: error: Syntaxfehler before '*' token
select_box.h:63: error: Syntaxfehler before '*' token
select_box.h:66: error: Syntaxfehler before '*' token
select_box.h:67: error: Syntaxfehler before '*' token
select_box.h:67: error: Syntaxfehler before '*' token
select_box.h:67: Warnung: type defaults to `int' in declaration of `status_box'
select_box.h:67: Warnung: data definition has no type or storage class
select_box.h:68: error: Syntaxfehler before '*' token
select_box.h:72: error: Syntaxfehler before '*' token
select_box.h:73: error: Syntaxfehler before '*' token
select_box.h:82: error: Syntaxfehler before '*' token
select_box.h:84: error: Syntaxfehler before '*' token
select_box.h:96: error: Syntaxfehler before '*' token
select_box.h:98: error: Syntaxfehler before '*' token
select_box.h:127: error: Syntaxfehler before '*' token
select_box.h:128: error: Syntaxfehler before '*' token
select_box.h:132: error: Syntaxfehler before '*' token
In file included from taper.h:48,
from vars.c:17:
structs.h:206: error: Syntaxfehler before '*' token
In file included from taper.h:49,
from vars.c:17:
vars.h:53: error: Syntaxfehler before '*' token
vars.h:53: Warnung: type defaults to `int' in declaration of `win_main'
vars.h:53: Warnung: type defaults to `int' in declaration of `title'
vars.h:53: Warnung: type defaults to `int' in declaration of `files'
vars.h:53: Warnung: type defaults to `int' in declaration of `selection'
vars.h:53: Warnung: type defaults to `int' in declaration of `bottom'
vars.h:53: Warnung: type defaults to `int' in declaration of `on_vol'
vars.h:53: Warnung: type defaults to `int' in declaration of `exclude'
vars.h:53: Warnung: data definition has no type or storage class
In file included from taper.h:50,
from vars.c:17:
common.h:25: error: Syntaxfehler before '*' token
common.h:39: error: Syntaxfehler before "WINDOW"
common.h:52: error: Syntaxfehler before '*' token
common.h:53: error: Syntaxfehler before '*' token
common.h:65: error: Syntaxfehler before '*' token
In file included from taper.h:51,
from vars.c:17:
tapeio.h:12: error: Syntaxfehler before '*' token
tapeio.h:20: error: Syntaxfehler before '*' token
tapeio.h:36: error: Syntaxfehler before '*' token
tapeio.h:41: error: Syntaxfehler before '*' token
vars.c:23: error: `FALSE' undeclared here (not in a function)
vars.c:23: error: Initialisierungselement ist nicht konstant
vars.c:23: error: (near initialization for `ap[2].save_pref')
vars.c:23: error: Initialisierungselement ist nicht konstant
vars.c:23: error: (near initialization for `ap[2]')
vars.c:24: error: Initialisierungselement ist nicht konstant
vars.c:24: error: (near initialization for `ap[3]')
vars.c:25: error: Initialisierungselement ist nicht konstant
vars.c:25: error: (near initialization for `ap[4]')
vars.c:26: error: Initialisierungselement ist nicht konstant
vars.c:26: error: (near initialization for `ap[5]')
vars.c:27: error: Initialisierungselement ist nicht konstant
vars.c:27: error: (near initialization for `ap[6]')
vars.c:28: error: Initialisierungselement ist nicht konstant
vars.c:28: error: (near initialization for `ap[7]')
vars.c:29: error: Initialisierungselement ist nicht konstant
vars.c:29: error: (near initialization for `ap[8]')
vars.c:30: error: `FALSE' undeclared here (not in a function)
vars.c:30: error: Initialisierungselement ist nicht konstant
vars.c:30: error: (near initialization for `ap[9].save_pref')
vars.c:30: error: Initialisierungselement ist nicht konstant
vars.c:30: error: (near initialization for `ap[9]')
vars.c:31: error: `FALSE' undeclared here (not in a function)
vars.c:31: error: Initialisierungselement ist nicht konstant
vars.c:31: error: (near initialization for `ap[10].save_pref')
vars.c:31: error: Initialisierungselement ist nicht konstant
vars.c:31: error: (near initialization for `ap[10]')
vars.c:32: error: `FALSE' undeclared here (not in a function)
vars.c:32: error: Initialisierungselement ist nicht konstant
vars.c:32: error: (near initialization for `ap[11].save_pref')
vars.c:32: error: Initialisierungselement ist nicht konstant
vars.c:32: error: (near initialization for `ap[11]')
vars.c:33: error: Initialisierungselement ist nicht konstant
vars.c:33: error: (near initialization for `ap[12]')
vars.c:34: error: Initialisierungselement ist nicht konstant
vars.c:34: error: (near initialization for `ap[13]')
vars.c:35: error: `FALSE' undeclared here (not in a function)
vars.c:35: error: Initialisierungselement ist nicht konstant
vars.c:35: error: (near initialization for `ap[14].save_pref')
vars.c:35: error: Initialisierungselement ist nicht konstant
vars.c:35: error: (near initialization for `ap[14]')
vars.c:36: error: Initialisierungselement ist nicht konstant
vars.c:36: error: (near initialization for `ap[15]')
vars.c:37: error: Initialisierungselement ist nicht konstant
vars.c:37: error: (near initialization for `ap[16]')
vars.c:38: error: Initialisierungselement ist nicht konstant
vars.c:38: error: (near initialization for `ap[17]')
vars.c:39: error: Initialisierungselement ist nicht konstant
vars.c:39: error: (near initialization for `ap[18]')
vars.c:40: error: Initialisierungselement ist nicht konstant
vars.c:40: error: (near initialization for `ap[19]')
vars.c:41: error: Initialisierungselement ist nicht konstant
vars.c:41: error: (near initialization for `ap[20]')
vars.c:43: error: `FALSE' undeclared here (not in a function)
vars.c:43: error: Initialisierungselement ist nicht konstant
vars.c:43: error: (near initialization for `ap[21].save_pref')
vars.c:43: error: Initialisierungselement ist nicht konstant
vars.c:43: error: (near initialization for `ap[21]')
vars.c:44: error: `FALSE' undeclared here (not in a function)
vars.c:44: error: Initialisierungselement ist nicht konstant
vars.c:44: error: (near initialization for `ap[22].save_pref')
vars.c:44: error: Initialisierungselement ist nicht konstant
vars.c:44: error: (near initialization for `ap[22]')
vars.c:45: error: Initialisierungselement ist nicht konstant
vars.c:45: error: (near initialization for `ap[23]')
vars.c:46: error: Initialisierungselement ist nicht konstant
vars.c:46: error: (near initialization for `ap[24]')
vars.c:47: error: Initialisierungselement ist nicht konstant
vars.c:47: error: (near initialization for `ap[25]')
vars.c:48: error: Initialisierungselement ist nicht konstant
vars.c:48: error: (near initialization for `ap[26]')
vars.c:49: error: `FALSE' undeclared here (not in a function)
vars.c:49: error: Initialisierungselement ist nicht konstant
vars.c:49: error: (near initialization for `ap[27].save_pref')
vars.c:49: error: Initialisierungselement ist nicht konstant
vars.c:49: error: (near initialization for `ap[27]')
vars.c:50: error: Initialisierungselement ist nicht konstant
vars.c:50: error: (near initialization for `ap[28]')
vars.c:51: error: Initialisierungselement ist nicht konstant
vars.c:51: error: (near initialization for `ap[29]')
vars.c:52: error: Initialisierungselement ist nicht konstant
vars.c:52: error: (near initialization for `ap[30]')
vars.c:53: error: Initialisierungselement ist nicht konstant
vars.c:53: error: (near initialization for `ap[31]')
vars.c:54: error: Initialisierungselement ist nicht konstant
vars.c:54: error: (near initialization for `ap[32]')
vars.c:55: error: Initialisierungselement ist nicht konstant
vars.c:55: error: (near initialization for `ap[33]')
vars.c:56: error: `FALSE' undeclared here (not in a function)
vars.c:56: error: Initialisierungselement ist nicht konstant
vars.c:56: error: (near initialization for `ap[34].save_pref')
vars.c:56: error: Initialisierungselement ist nicht konstant
vars.c:56: error: (near initialization for `ap[34]')
vars.c:57: error: Initialisierungselement ist nicht konstant
vars.c:57: error: (near initialization for `ap[35]')
vars.c:58: error: Initialisierungselement ist nicht konstant
vars.c:58: error: (near initialization for `ap[36]')
vars.c:59: error: Initialisierungselement ist nicht konstant
vars.c:59: error: (near initialization for `ap[37]')
vars.c:60: error: `FALSE' undeclared here (not in a function)
vars.c:60: error: Initialisierungselement ist nicht konstant
vars.c:60: error: (near initialization for `ap[38].save_pref')
vars.c:60: error: Initialisierungselement ist nicht konstant
vars.c:60: error: (near initialization for `ap[38]')
vars.c:61: error: Initialisierungselement ist nicht konstant
vars.c:61: error: (near initialization for `ap[39]')
vars.c:62: error: Initialisierungselement ist nicht konstant
vars.c:62: error: (near initialization for `ap[40]')
vars.c:63: error: Initialisierungselement ist nicht konstant
vars.c:63: error: (near initialization for `ap[41]')
vars.c:64: error: Initialisierungselement ist nicht konstant
vars.c:64: error: (near initialization for `ap[42]')
vars.c:65: error: Initialisierungselement ist nicht konstant
vars.c:65: error: (near initialization for `ap[43]')
vars.c:66: error: Initialisierungselement ist nicht konstant
vars.c:66: error: (near initialization for `ap[44]')
vars.c:67: error: Initialisierungselement ist nicht konstant
vars.c:67: error: (near initialization for `ap[45]')
vars.c:68: error: Initialisierungselement ist nicht konstant
vars.c:68: error: (near initialization for `ap[46]')
vars.c:69: error: `FALSE' undeclared here (not in a function)
vars.c:69: error: Initialisierungselement ist nicht konstant
vars.c:69: error: (near initialization for `ap[47].save_pref')
vars.c:69: error: Initialisierungselement ist nicht konstant
vars.c:69: error: (near initialization for `ap[47]')
vars.c:70: error: Initialisierungselement ist nicht konstant
vars.c:70: error: (near initialization for `ap[48]')
vars.c:71: error: Initialisierungselement ist nicht konstant
vars.c:71: error: (near initialization for `ap[49]')
vars.c:72: error: Initialisierungselement ist nicht konstant
vars.c:72: error: (near initialization for `ap[50]')
vars.c:73: error: Initialisierungselement ist nicht konstant
vars.c:73: error: (near initialization for `ap[51]')
vars.c:74: error: `FALSE' undeclared here (not in a function)
vars.c:74: error: Initialisierungselement ist nicht konstant
vars.c:74: error: (near initialization for `ap[52].save_pref')
vars.c:74: error: Initialisierungselement ist nicht konstant
vars.c:74: error: (near initialization for `ap[52]')
vars.c:75: error: Initialisierungselement ist nicht konstant
vars.c:75: error: (near initialization for `ap[53]')
vars.c:76: error: Initialisierungselement ist nicht konstant
vars.c:76: error: (near initialization for `ap[54]')
vars.c:77: error: Initialisierungselement ist nicht konstant
vars.c:77: error: (near initialization for `ap[55]')
vars.c:78: error: Initialisierungselement ist nicht konstant
vars.c:78: error: (near initialization for `ap[56]')
vars.c:79: error: Initialisierungselement ist nicht konstant
vars.c:79: error: (near initialization for `ap[57]')
vars.c:80: error: Initialisierungselement ist nicht konstant
vars.c:80: error: (near initialization for `ap[58]')
vars.c:81: error: Initialisierungselement ist nicht konstant
vars.c:81: error: (near initialization for `ap[59]')
vars.c:82: error: Initialisierungselement ist nicht konstant
vars.c:82: error: (near initialization for `ap[60]')
vars.c:83: error: Initialisierungselement ist nicht konstant
vars.c:83: error: (near initialization for `ap[61]')
vars.c:84: error: Initialisierungselement ist nicht konstant
vars.c:84: error: (near initialization for `ap[62]')
vars.c:85: error: Initialisierungselement ist nicht konstant
vars.c:85: error: (near initialization for `ap[63]')
vars.c:86: error: Initialisierungselement ist nicht konstant
vars.c:86: error: (near initialization for `ap[64]')
vars.c:91: error: `COLOR_BLUE' undeclared here (not in a function)
vars.c:92: error: `COLOR_WHITE' undeclared here (not in a function)
vars.c:93: error: `COLOR_WHITE' undeclared here (not in a function)
vars.c:94: error: `COLOR_BLUE' undeclared here (not in a function)
vars.c:95: error: `COLOR_WHITE' undeclared here (not in a function)
vars.c:96: error: `COLOR_RED' undeclared here (not in a function)
vars.c:97: error: `COLOR_WHITE' undeclared here (not in a function)
vars.c:98: error: `COLOR_RED' undeclared here (not in a function)
vars.c:99: error: `COLOR_WHITE' undeclared here (not in a function)
vars.c:100: error: `COLOR_BLUE' undeclared here (not in a function)
vars.c:101: error: `COLOR_WHITE' undeclared here (not in a function)
vars.c:102: error: `COLOR_BLUE' undeclared here (not in a function)
vars.c:103: error: `COLOR_BLACK' undeclared here (not in a function)
vars.c:104: error: `COLOR_GREEN' undeclared here (not in a function)
vars.c:105: error: `COLOR_WHITE' undeclared here (not in a function)
vars.c:106: error: `COLOR_MAGENTA' undeclared here (not in a function)
vars.c:107: error: `COLOR_BLUE' undeclared here (not in a function)
vars.c:108: error: `COLOR_WHITE' undeclared here (not in a function)
vars.c:109: error: `COLOR_BLACK' undeclared here (not in a function)
vars.c:110: error: `COLOR_CYAN' undeclared here (not in a function)
vars.c:111: error: `COLOR_WHITE' undeclared here (not in a function)
vars.c:112: error: `COLOR_BLACK' undeclared here (not in a function)
vars.c:140: error: Syntaxfehler before '*' token
vars.c:140: Warnung: type defaults to `int' in declaration of `title'
vars.c:140: Warnung: type defaults to `int' in declaration of `files'
vars.c:140: Warnung: type defaults to `int' in declaration of `selection'
vars.c:140: Warnung: type defaults to `int' in declaration of `bottom'
vars.c:140: Warnung: type defaults to `int' in declaration of `on_vol'
vars.c:140: Warnung: type defaults to `int' in declaration of `exclude'
vars.c:140: Warnung: data definition has no type or storage class
make: *** [vars.o] Fehler 1
debian:~/taper/taper-6.9b#

Gruß

Daniel
Ähnliche Inhalte
Backup
Tape Libary : Auslagerung von Tapes
Frage von bud5890Backup3 Kommentare

Moin Zusammen, ich habe eine grundsätzliche Frage zu der Auslaegrung einzelner oder mehrerer Tapes aus einer Tape Libary. Wie ...

Windows 8
IDL Installations Probleme
Frage von FragnantWindows 83 Kommentare

Hallo, ich bin dabei IDL auf einem Userpc zu Installieren & hänge momentan an folgendem Fehler fest. Habe schon ...

CMS
Probleme mit Contao Installation
gelöst Frage von lasterCMS4 Kommentare

Guten Abend, habe Ubuntu Server 16.04.1 LTS mit Apache2, PHP5.6 und MySQL 14.14 . Nun habe ich Contao 3.5 ...

RedHat, CentOS, Fedora

Probleme bei Installation eines Patches !

gelöst Frage von 116480RedHat, CentOS, Fedora2 Kommentare

Hallo Zusammen, ich muss sagen ich mache mit Linux eigentlich nicht viel. Daher wohl auch mein Problem. Ich bin ...

Neue Wissensbeiträge
Microsoft
Shadow Defender
Tipp von Hyrule vor 9 StundenMicrosoft

Ich denke viele kennen es: Ein Update oder ein neues Programm und vieles funktioniert nicht mehr wie gewünscht. Die ...

Microsoft
Microsoft verarztet 50 Sicherheitslücken
Tipp von Hyrule vor 4 TagenMicrosoft

Microsoft verarztet mal wieder ein "paar" Sicherheitslücken in ihren Produkten: Und mal wieder Remote Code Execution und der abartige ...

Sicherheit

Prüfskript gegen Spectre und Co. wurde erweitert

Tipp von DerWoWusste vor 5 TagenSicherheit

Moin. Get-SpeculationControlSettings sagt sicherlich den meisten etwas. Mit den neuen Spectrevarianten muss man nun weitere Schritte machen, um zu ...

LAN, WAN, Wireless

IPhone und iPad scheinen Verbindungsprobleme mit Unifi v5.7.23 und 802.11r (schnelles Roaming) zu haben

Erfahrungsbericht von StefanKittel vor 8 TagenLAN, WAN, Wireless4 Kommentare

Hallo, vielleicht hilft dieser recht kurze Bericht doch den Einen oder Anderen. Ausgangspunkt Ein Kunde von mir setzt einen ...

Heiß diskutierte Inhalte
Hyper-V
Hyper V startet nicht wenn eine Offline geschaltene HD integriert wird
Frage von DieAzubinneHyper-V11 Kommentare

Hallö, bei einem PC der mit Windows 10 Pro installiert ist habe ich das Problem, dass der Virtuelle PC ...

CPU, RAM, Mainboards
ASUS P5W DELUXE startet nur manchmal und nur mit 2 GraKas
Frage von Windows10GegnerCPU, RAM, Mainboards11 Kommentare

Hallo, ich habe das o.g. Motherboard erhalten. Egal ob C2D 8400, Pentium D 945 oder P4 670, das teil ...

Virtualisierung
Virtuelle Maschinen langsam unabhängig vom Hypervisor
gelöst Frage von HyruleVirtualisierung8 Kommentare

Hallo, ich möchte gerne zwei bis drei virtuelle Maschinen virtualisieren, darauf sollen jeweils Windows 10 und diverse etwas größere ...

Rechtliche Fragen
Vorlage "private Nutzung dienstlicher Mobiltelefone"
Frage von linos2Rechtliche Fragen8 Kommentare

Hallo zusammen, ich bin auf der Suche nach einer Vorlage für die private Nutzung von dienstlichen Mobiltelefonen. Unsere Firma ...